{"text_format":"1","workbook":"xlsx","n_sheets":20,"sheets":["START","Instructions","Template names","Lookup and lists","E1-Sum","E2-FinPerf","E3-Capex","E4-FinPos","E5-CFlow","SE1","SE2","SE3","SE4","SE5","SE6a","SE6b","SE6c","SE6d","SE6e","SE7"],"not_rendered":{"charts":0,"images":20,"macros":1,"external_links":9,"defined_names":1954,"comments":0,"pivot_tables":0},"unopened":[],"bounds":{"document_bytes":16777216,"sheet_cells":100000,"rows_first":2000,"rows_last":500,"rows_between":2000,"halvings":0,"cell_chars":16384,"cell_head_chars":4096},"cells_cut":0,"cells_raw":0,"read":"whole","date_system":"1900"}

{"sheet":"START","index":0,"n_rows":1,"n_cols":1,"rows_kept":1,"cut":false,"hidden":false,"merged":[]}
[""]

{"sheet":"Instructions","index":1,"n_rows":38,"n_cols":24,"rows_kept":38,"cut":false,"hidden":false,"merged":[]}
[]
[null,null,null,2020]
[]
[null,null,null,null,null,null,null,null,null,null,null,null,null,null,null,null,null,null,null,null,null,null,null,"Yes"]
[null,null,null,null,null,null,null,null,null,null,null,null,null,null,null,null,null,null,null,null,null,null,null,"No"]
[]
{"$rows_left_out":33}
{"sheet":"Template names","index":2,"n_rows":95,"n_cols":4,"rows_kept":95,"cut":false,"hidden":true,"merged":[[0,0,0,3],[74,0,74,3],[77,0,77,1]]}
["Common sheet headings"]
["Head1",{"$f":"HLOOKUP(MTREF,Headings,2)","v":"2023/24"},"Prior year -1"]
["Head1A",{"$f":"HLOOKUP(MTREF,Headings,3)","v":"2022/23"},"Prior year -2"]
["Head1B",{"$f":"HLOOKUP(MTREF,Headings,4)","v":"2021/22"},"Prior year -3"]
["Head2",{"$f":"HLOOKUP(MTREF,Headings,5)","v":"2024/25 Medium Term Revenue & Expenditure Framework"},"Year in which budget is being prepared"]
["Head2A",{"$f":"HLOOKUP(MTREF,Headings,6)","v":"2024/25"},"Year in which budget is being prepared"]
{"$rows_left_out":90}
{"sheet":"Lookup and lists","index":3,"n_rows":286,"n_cols":22,"rows_kept":286,"cut":false,"hidden":true,"merged":[]}
["Description",2013,2014,2015,2016,2017,2018,2019,2020,2021,2022,2023,2024,2025,2026,null,"Grants:","National - opex","Provincial - opex","National - capex","Provincial - capex"]
[{"$f":"'[8]Template names'!C2","v":"Prior year -1"},{"$f":"B1-1&\"/\"&RIGHT(B1,2)-0","v":"2012/13"},{"$f":"C1-1&\"/\"&RIGHT(C1,2)-0","v":"2013/14"},{"$f":"D1-1&\"/\"&RIGHT(D1,2)-0","v":"2014/15"},{"$f":"E1-1&\"/\"&RIGHT(E1,2)-0","v":"2015/16"},"2016/17","2017/18","2018/19","2019/20","2020/21","2021/22","2022/23","2023/24","2024/25","2025/26",null,null,"  Equitable share","  Health subsidy","  Municipal Infrastructure (MIG)"]
[{"$f":"'[8]Template names'!C3","v":"Prior year -2"},{"$f":"B1-2&\"/\"&RIGHT(B1,2)-1","v":"2011/12"},{"$f":"C1-2&\"/\"&RIGHT(C1,2)-1","v":"2012/13"},{"$f":"D1-2&\"/\"&RIGHT(D1,2)-1","v":"2013/14"},{"$f":"E1-2&\"/\"&RIGHT(E1,2)-1","v":"2014/15"},"2015/16","2016/17","2017/18","2018/19","2019/20","2020/21","2021/22","2022/23","2023/24","2024/25",null,null,"  Levy replacement","  Ambulance subsidy","  Public Transport"]
[{"$f":"'[8]Template names'!C4","v":"Prior year -3"},{"$f":"B1-3&\"/\"&RIGHT(B1,2)-2","v":"2010/11"},{"$f":"C1-3&\"/\"&RIGHT(C1,2)-2","v":"2011/12"},{"$f":"D1-3&\"/\"&RIGHT(D1,2)-2","v":"2012/13"},{"$f":"E1-3&\"/\"&RIGHT(E1,2)-2","v":"2013/14"},"2014/15","2015/16","2016/17","2017/18","2018/19","2019/20","2020/21","2021/22","2022/23","2023/24",null,null,"  Finance Management","  Housing","  Public Works"]
[{"$f":"'[8]Template names'!C7","v":"MTREF header name"},{"$f":"B1&\"/\"&RIGHT(B1,2)+1&\" Medium Term Revenue & Expenditure Framework\"","v":"2013/14 Medium Term Revenue & Expenditure Framework"},{"$f":"C1&\"/\"&RIGHT(C1,2)+1&\" Medium Term Revenue & Expenditure Framework\"","v":"2014/15 Medium Term Revenue & Expenditure Framework"},{"$f":"D1&\"/\"&RIGHT(D1,2)+1&\" Medium Term Revenue & Expenditure Framework\"","v":"2015/16 Medium Term Revenue & Expenditure Framework"},{"$f":"E1&\"/\"&RIGHT(E1,2)+1&\" Medium Term Revenue & Expenditure Framework\"","v":"2016/17 Medium Term Revenue & Expenditure Framework"},"2017/18 Medium Term Revenue & Expenditure Framework","2018/19 Medium Term Revenue & Expenditure Framework","2019/20 Medium Term Revenue & Expenditure Framework","2020/21 Medium Term Revenue & Expenditure Framework","2021/22 Medium Term Revenue & Expenditure Framework","2022/23 Medium Term Revenue & Expenditure Framework","2023/24 Medium Term Revenue & Expenditure Framework","2024/25 Medium Term Revenue & Expenditure Framework","2025/26 Medium Term Revenue & Expenditure Framework","2026/27 Medium Term Revenue & Expenditure Framework",null,null,"  Municipal Systems Improvement","  Sports and Recreation","  Sport and Recreation"]
[{"$f":"'[8]Template names'!C6","v":"Approved budget year"},{"$f":"B1&\"/\"&RIGHT(B1,2)+1","v":"2013/14"},{"$f":"C1&\"/\"&RIGHT(C1,2)+1","v":"2014/15"},{"$f":"D1&\"/\"&RIGHT(D1,2)+1","v":"2015/16"},{"$f":"E1&\"/\"&RIGHT(E1,2)+1","v":"2016/17"},"2017/18","2018/19","2019/20","2020/21","2021/22","2022/23","2023/24","2024/25","2025/26","2026/27",null,null,"  Restructuring",null,"  Water Affairs"]
{"$rows_left_out":281}
{"sheet":"E1-Sum","index":4,"n_rows":55,"n_cols":11,"rows_kept":55,"cut":false,"hidden":false,"merged":[[1,1,1,8],[0,0,0,10]]}
[{"$f":"MEABsum&\" - \"&Date","v":" - Table E1 Adjustments Budget Summary - July 2021"}]
[{"$f":"desc","v":"Description"},{"$f":"Head9","v":"Budget Year +1 2025/26"},null,null,null,null,null,null,null,{"$f":"Head10","v":"Budget Year +2 2026/27"},{"$f":"Head11","v":"Annual target 2024/25"}]
[null,{"$f":"Head6","v":"Original Budget"},{"$f":"Head54","v":"Prior Adjusted"},{"$f":"Head59","v":"Downward adjusts"},{"$f":"Head58","v":"Parent muni."},{"$f":"Head53","v":"Unfore. Unavoid."},{"$f":"Head50","v":"Other Adjusts."},{"$f":"Head56","v":"Total Adjusts."},{"$f":"Head7","v":"Adjusted Budget"},{"$f":"Head7","v":"Adjusted Budget"},{"$f":"Head7","v":"Adjusted Budget"}]
[null,null,1,2,3,4,5,6,7]
["R thousands","A","A1","B","C","D","E","F","G"]
["Financial Performance"]
{"$rows_left_out":50}
{"sheet":"E2-FinPerf","index":5,"n_rows":68,"n_cols":12,"rows_kept":68,"cut":false,"hidden":false,"merged":[[1,2,1,9],[1,1,3,1],[1,0,3,0]]}
[{"$f":"MEAB1&\"  - \"&Date","v":" - Table E2 Adjustments Budget - Financial Performance (revenue and expenditure)  - July 2021"}]
[{"$f":"desc","v":"Description"},{"$f":"head27","v":"Ref"},{"$f":"Head9","v":"Budget Year +1 2025/26"},null,null,null,null,null,null,null,{"$f":"Head10","v":"Budget Year +2 2026/27"},{"$f":"Head11","v":"Annual target 2024/25"}]
[null,null,{"$f":"Head6","v":"Original Budget"},{"$f":"Head54","v":"Prior Adjusted"},{"$f":"Head59","v":"Downward adjusts"},{"$f":"Head58","v":"Parent muni."},{"$f":"Head53","v":"Unfore. Unavoid."},{"$f":"Head50","v":"Other Adjusts."},{"$f":"Head56","v":"Total Adjusts."},{"$f":"Head7","v":"Adjusted Budget"},{"$f":"Head7","v":"Adjusted Budget"},{"$f":"Head7","v":"Adjusted Budget"}]
[null,null,null,1,2,3,4,5,6,7]
["R thousands",null,"A","A1","B","C","D","E","F","G"]
["Exchange Revenue"]
{"$rows_left_out":63}
{"sheet":"E3-Capex","index":6,"n_rows":196,"n_cols":12,"rows_kept":196,"cut":false,"hidden":false,"merged":[[1,0,2,0],[1,1,2,1],[1,2,1,9],[189,0,189,10]]}
[{"$f":"MEAB3a&\" - \"&Date","v":" - Table E3 Adjustments Capital Expenditure Budget by asset class and funding - July 2021"}]
[{"$f":"desc","v":"Description"},{"$f":"head27","v":"Ref"},{"$f":"Head9","v":"Budget Year +1 2025/26"},null,null,null,null,null,null,null,{"$f":"Head10","v":"Budget Year +2 2026/27"},{"$f":"Head11","v":"Annual target 2024/25"}]
[null,null,{"$f":"Head6","v":"Original Budget"},{"$f":"Head54","v":"Prior Adjusted"},{"$f":"Head59","v":"Downward adjusts"},{"$f":"Head58","v":"Parent muni."},{"$f":"Head53","v":"Unfore. Unavoid."},{"$f":"Head50","v":"Other Adjusts."},{"$f":"Head56","v":"Total Adjusts."},{"$f":"Head7","v":"Adjusted Budget"},"Adjusted Budget","Adjusted Budget"]
[null,null,null,1,2,3,4,5,6,7]
["R thousands",1,"A","A1","B","C","D","E","F","G"]
["Capital expenditure by Asset Class/Sub-class"]
{"$rows_left_out":191}
{"sheet":"E4-FinPos","index":7,"n_rows":67,"n_cols":12,"rows_kept":67,"cut":false,"hidden":false,"merged":[[1,2,1,9],[1,0,3,0],[1,1,3,1]]}
[{"$f":"MEAB3&\" - \"&Date","v":" - Table E4 Adjustments Budget - Financial Position - July 2021"}]
[{"$f":"desc","v":"Description"},{"$f":"head27","v":"Ref"},{"$f":"Head9","v":"Budget Year +1 2025/26"},null,null,null,null,null,null,null,{"$f":"Head10","v":"Budget Year +2 2026/27"},{"$f":"Head11","v":"Annual target 2024/25"}]
[null,null,{"$f":"Head6","v":"Original Budget"},{"$f":"Head54","v":"Prior Adjusted"},{"$f":"Head59","v":"Downward adjusts"},{"$f":"Head58","v":"Parent muni."},{"$f":"Head53","v":"Unfore. Unavoid."},{"$f":"Head50","v":"Other Adjusts."},{"$f":"Head56","v":"Total Adjusts."},{"$f":"Head7","v":"Adjusted Budget"},{"$f":"Head7","v":"Adjusted Budget"},{"$f":"Head7","v":"Adjusted Budget"}]
[null,null,null,1,2,3,4,5,6,7]
["R thousands",null,"A","A1","B","C","D","E","F","G"]
["ASSETS"]
{"$rows_left_out":62}
{"sheet":"E5-CFlow","index":8,"n_rows":53,"n_cols":12,"rows_kept":53,"cut":false,"hidden":false,"merged":[[1,2,1,9],[1,0,3,0],[1,1,3,1]]}
[{"$f":"MEAB4&\" - \"&Date","v":" - Table E5 Adjustments Budget - Cash Flows - July 2021"}]
[{"$f":"desc","v":"Description"},{"$f":"head27","v":"Ref"},{"$f":"Head9","v":"Budget Year +1 2025/26"},null,null,null,null,null,null,null,{"$f":"Head10","v":"Budget Year +2 2026/27"},{"$f":"Head11","v":"Annual target 2024/25"}]
[null,null,{"$f":"Head6","v":"Original Budget"},{"$f":"Head54","v":"Prior Adjusted"},{"$f":"Head59","v":"Downward adjusts"},{"$f":"Head58","v":"Parent muni."},{"$f":"Head53","v":"Unfore. Unavoid."},{"$f":"Head50","v":"Other Adjusts."},{"$f":"Head56","v":"Total Adjusts."},{"$f":"Head7","v":"Adjusted Budget"},{"$f":"Head7","v":"Adjusted Budget"},{"$f":"Head7","v":"Adjusted Budget"}]
[null,null,null,1,2,3,4,5,6,7]
["R thousands",null,"A","A1","B","C","D","E","F","G"]
["CASH FLOW FROM OPERATING ACTIVITIES"]
{"$rows_left_out":48}
{"sheet":"SE1","index":9,"n_rows":34,"n_cols":12,"rows_kept":34,"cut":false,"hidden":false,"merged":[[1,0,4,0],[1,1,4,1],[1,2,1,9]]}
[{"$f":"MEAB5&\" - \"&Date","v":" - Supporting Table SE1  Adjustments Budget - measurable performance targets - July 2021"}]
["Performance target description","Unit of measurement",{"$f":"Head9","v":"Budget Year +1 2025/26"},null,null,null,null,null,null,null,{"$f":"Head10","v":"Budget Year +2 2026/27"},{"$f":"Head11","v":"Annual target 2024/25"}]
[null,null,{"$f":"Head6","v":"Original Budget"},{"$f":"Head54","v":"Prior Adjusted"},{"$f":"Head59","v":"Downward adjusts"},{"$f":"Head58","v":"Parent muni."},{"$f":"Head53","v":"Unfore. Unavoid."},{"$f":"Head50","v":"Other Adjusts."},{"$f":"Head56","v":"Total Adjusts."},{"$f":"Head7","v":"Adjusted Budget"},{"$f":"Head7","v":"Adjusted Budget"},{"$f":"Head7","v":"Adjusted Budget"}]
[null,null,null,1,2,3,4,5,6,7]
[null,null,"A","A1","B","C","D","E","F","G"]
[null,null,null,null,null,null,null,null,{"$f":"SUM(E6:H6)","v":0},{"$f":"IF(D6=0,C6+I6,D6+I6)","v":0}]
{"$rows_left_out":29}
{"sheet":"SE2","index":10,"n_rows":45,"n_cols":7,"rows_kept":45,"cut":false,"hidden":false,"merged":[[1,0,2,0],[1,1,2,1],[1,2,2,2],[1,3,1,4]]}
[{"$f":"MEAB6&\" - \"&Date","v":" - Supporting Table SE2   Adjustments Budget  - financial and non-financial indicators - July 2021"}]
["Description of financial indicator","Basis of calculation",{"$f":"head27","v":"Ref"},{"$f":"Head9","v":"Budget Year +1 2025/26"},null,{"$f":"Head10","v":"Budget Year +2 2026/27"},{"$f":"Head11","v":"Annual target 2024/25"}]
[null,null,null,{"$f":"Head6","v":"Original Budget"},{"$f":"Head7","v":"Adjusted Budget"},{"$f":"Head7","v":"Adjusted Budget"},{"$f":"Head7","v":"Adjusted Budget"}]
["Borrowing Management"]
["Credit Rating"]
["Borrowing to Asset Ratio","Total Long-term Borrowing/ Total Assets",null,{"$f":"IF(ISERROR('E4-FinPos'!C45/'E4-FinPos'!C30),0,('E4-FinPos'!C45/'E4-FinPos'!C30))","v":0},{"$f":"IF(ISERROR('E4-FinPos'!J45/'E4-FinPos'!J30),0,('E4-FinPos'!J45/'E4-FinPos'!J30))","v":0},{"$f":"IF(ISERROR('E4-FinPos'!K45/'E4-FinPos'!K30),0,('E4-FinPos'!K45/'E4-FinPos'!K30))","v":0},{"$f":"IF(ISERROR('E4-FinPos'!L45/'E4-FinPos'!L30),0,('E4-FinPos'!L45/'E4-FinPos'!L30))","v":0}]
{"$rows_left_out":40}
{"sheet":"SE3","index":11,"n_rows":26,"n_cols":10,"rows_kept":26,"cut":false,"hidden":false,"merged":[[2,5,3,5],[2,6,3,6],[1,0,2,0],[1,1,2,1],[2,3,3,3],[2,4,3,4],[1,2,1,9]]}
[{"$f":"MEAB7&\" - \"&Date","v":" - Supporting Table SE3   Adjustments Budget  - investment Portfolio - July 2021"}]
["Investments by maturity\nName of institution & investment ID",{"$f":"head27","v":"Ref"},{"$f":"Head9","v":"Budget Year +1 2025/26"}]
[null,null,"Period of investment","Type of investment","Expiry date of investment","Accrued interest for the month","Yield\n%","Market value"]
["R thousands",null,"Months",null,null,null,null,"Begin","Change","End"]
[]
[]
{"$rows_left_out":21}
{"sheet":"SE4","index":12,"n_rows":58,"n_cols":12,"rows_kept":58,"cut":false,"hidden":false,"merged":[[1,2,1,9],[1,0,3,0],[1,1,3,1]]}
[{"$f":"MEAB8&\" - \"&Date","v":" - Supporting Table SE4   Adjustments Budget  - board member allowances and staff benefits - July 2021"}]
["Summary of Employee and Board Member remuneration",{"$f":"head27","v":"Ref"},{"$f":"Head9","v":"Budget Year +1 2025/26"},null,null,null,null,null,null,null,{"$f":"Head10","v":"Budget Year +2 2026/27"},{"$f":"Head11","v":"Annual target 2024/25"}]
[null,null,{"$f":"Head6","v":"Original Budget"},{"$f":"Head54","v":"Prior Adjusted"},{"$f":"Head59","v":"Downward adjusts"},{"$f":"Head58","v":"Parent muni."},{"$f":"Head53","v":"Unfore. Unavoid."},{"$f":"Head50","v":"Other Adjusts."},{"$f":"Head56","v":"Total Adjusts."},{"$f":"Head7","v":"Adjusted Budget"},{"$f":"Head7","v":"Adjusted Budget"},{"$f":"Head7","v":"Adjusted Budget"}]
[null,null,null,3,4,5,6,7,8,9]
["R thousands",null,"A","A1","B","C","D","E","F","G"]
["Remuneration"]
{"$rows_left_out":53}
{"sheet":"SE5","index":13,"n_rows":266,"n_cols":16,"rows_kept":266,"cut":false,"hidden":false,"merged":[[1,0,2,0],[1,1,1,12]]}
[{"$f":"MEAB9&\" - \"&Date","v":" - Supporting Table SE5   Adjustments Budget  - monthly cash and revenue/expenditure - July 2021"}]
[{"$f":"desc","v":"Description"},{"$f":"Head9","v":"Budget Year +1 2025/26"},null,null,null,null,null,null,null,null,null,null,null,"Medium Term Revenue and Expenditure Framework"]
[null,"July","August","Sept.","October","November","December","January","February","March","April","May","June",{"$f":"Head9","v":"Budget Year +1 2025/26"},{"$f":"Head10","v":"Budget Year +2 2026/27"},{"$f":"Head11","v":"Annual target 2024/25"}]
["R thousands",{"$f":"Head5A","v":"Outcome"},"Outcome","Outcome","Outcome","Outcome","Outcome",{"$f":"Head7","v":"Adjusted Budget"},"Adjusted Budget","Adjusted Budget","Adjusted Budget","Adjusted Budget","Adjusted Budget",{"$f":"Head7","v":"Adjusted Budget"},{"$f":"Head7","v":"Adjusted Budget"},{"$f":"Head7","v":"Adjusted Budget"}]
["Operating Revenue By Source"]
["Exchange Revenue"]
{"$rows_left_out":261}
{"sheet":"SE6a","index":14,"n_rows":182,"n_cols":12,"rows_kept":182,"cut":false,"hidden":false,"merged":[[1,0,2,0],[1,1,2,1],[1,2,1,9]]}
[{"$f":"MEAB10a&\" - \"&Date","v":" - Supporting Table SE6a   Adjustments capital expenditure on new assets by asset category - July 2021"}]
[{"$f":"desc","v":"Description"},{"$f":"head27","v":"Ref"},{"$f":"Head9","v":"Budget Year +1 2025/26"},null,null,null,null,null,null,null,"Budget Year +1 2015/16","Budget Year +2 2016/17"]
[null,null,{"$f":"Head6","v":"Original Budget"},{"$f":"Head54","v":"Prior Adjusted"},{"$f":"Head59","v":"Downward adjusts"},{"$f":"Head58","v":"Parent muni."},{"$f":"Head53","v":"Unfore. Unavoid."},{"$f":"Head50","v":"Other Adjusts."},{"$f":"Head56","v":"Total Adjusts."},{"$f":"Head7","v":"Adjusted Budget"},"Adjusted Budget","Adjusted Budget"]
[null,null,null,1,2,3,4,5,6,7]
["R thousands",1,"A","A1","B","C","D","E","F","G"]
["Capital expenditure on new assets by Asset Class/Sub-class"]
{"$rows_left_out":177}
{"sheet":"SE6b","index":15,"n_rows":182,"n_cols":12,"rows_kept":182,"cut":false,"hidden":false,"merged":[[1,0,2,0],[1,1,2,1],[1,2,1,9]]}
[{"$f":"MEAB10b&\" - \"&Date","v":" - Supporting Table SE6b Adjustments capital expenditure on renewal of existing assets by asset category - July 2021"}]
[{"$f":"desc","v":"Description"},{"$f":"head27","v":"Ref"},{"$f":"Head9","v":"Budget Year +1 2025/26"},null,null,null,null,null,null,null,"Budget Year +1 2015/16","Budget Year +2 2016/17"]
[null,null,{"$f":"Head6","v":"Original Budget"},{"$f":"Head54","v":"Prior Adjusted"},{"$f":"Head59","v":"Downward adjusts"},{"$f":"Head58","v":"Parent muni."},{"$f":"Head53","v":"Unfore. Unavoid."},{"$f":"Head50","v":"Other Adjusts."},{"$f":"Head56","v":"Total Adjusts."},{"$f":"Head7","v":"Adjusted Budget"},"Adjusted Budget","Adjusted Budget"]
[null,null,null,1,2,3,4,5,6,7]
["R thousands",1,"A","A1","B","C","D","E","F","G"]
["Capital expenditure on renewal of existing assets by Asset Class/Sub-class"]
{"$rows_left_out":177}
{"sheet":"SE6c","index":16,"n_rows":180,"n_cols":12,"rows_kept":180,"cut":false,"hidden":false,"merged":[[1,2,1,9],[1,0,2,0],[1,1,2,1]]}
[{"$f":"MEAB10c&\" - \"&Date","v":" - Supporting Table SE6c Adjustments expenditure on repairs and maintenance by asset category - July 2021"}]
[{"$f":"desc","v":"Description"},{"$f":"head27","v":"Ref"},{"$f":"Head9","v":"Budget Year +1 2025/26"},null,null,null,null,null,null,null,"Budget Year +1 2015/16","Budget Year +2 2016/17"]
[null,null,{"$f":"Head6","v":"Original Budget"},{"$f":"Head54","v":"Prior Adjusted"},{"$f":"Head59","v":"Downward adjusts"},{"$f":"Head58","v":"Parent muni."},{"$f":"Head53","v":"Unfore. Unavoid."},{"$f":"Head50","v":"Other Adjusts."},{"$f":"Head56","v":"Total Adjusts."},{"$f":"Head7","v":"Adjusted Budget"},"Adjusted Budget","Adjusted Budget"]
[null,null,null,1,2,3,4,5,6,7]
["R thousands",1,"A","A1","B","C","D","E","F","G"]
["Repairs and maintenance expenditure by Asset Class/Sub-class"]
{"$rows_left_out":175}
{"sheet":"SE6d","index":17,"n_rows":182,"n_cols":12,"rows_kept":182,"cut":false,"hidden":false,"merged":[[1,0,2,0],[1,1,2,1],[1,2,1,9]]}
[{"$f":"MEAB10d&\" - \"&Date","v":" - Supporting Table SE6d Adjustments Depreciation by asset category - July 2021"}]
[{"$f":"desc","v":"Description"},{"$f":"head27","v":"Ref"},{"$f":"Head9","v":"Budget Year +1 2025/26"},null,null,null,null,null,null,null,"Budget Year +1 2015/16","Budget Year +2 2016/17"]
[null,null,{"$f":"Head6","v":"Original Budget"},{"$f":"Head54","v":"Prior Adjusted"},{"$f":"Head59","v":"Downward adjusts"},{"$f":"Head58","v":"Parent muni."},{"$f":"Head53","v":"Unfore. Unavoid."},{"$f":"Head50","v":"Other Adjusts."},{"$f":"Head56","v":"Total Adjusts."},{"$f":"Head7","v":"Adjusted Budget"},"Adjusted Budget","Adjusted Budget"]
[null,null,null,1,2,3,4,5,6,7]
["R thousands",1,"A","A1","B","C","D","E","F","G"]
["Depreciation by Asset Class/Sub-class"]
{"$rows_left_out":177}
{"sheet":"SE6e","index":18,"n_rows":182,"n_cols":12,"rows_kept":182,"cut":false,"hidden":false,"merged":[[1,0,2,0],[1,1,2,1],[1,2,1,9]]}
[{"$f":"MEAB10e&\" - \"&Date","v":" - Supporting Table SE6e   Adjustments capital expenditure on upgrading of existing assets by asset category - July 2021"}]
[{"$f":"desc","v":"Description"},{"$f":"head27","v":"Ref"},{"$f":"Head9","v":"Budget Year +1 2025/26"},null,null,null,null,null,null,null,"Budget Year +1 2015/16","Budget Year +2 2016/17"]
[null,null,{"$f":"Head6","v":"Original Budget"},{"$f":"Head54","v":"Prior Adjusted"},{"$f":"Head59","v":"Downward adjusts"},{"$f":"Head58","v":"Parent muni."},{"$f":"Head53","v":"Unfore. Unavoid."},{"$f":"Head50","v":"Other Adjusts."},{"$f":"Head56","v":"Total Adjusts."},{"$f":"Head7","v":"Adjusted Budget"},"Adjusted Budget","Adjusted Budget"]
[null,null,null,1,2,3,4,5,6,7]
["R thousands",1,"A","A1","B","C","D","E","F","G"]
["Capital expenditure on upgrading of existing assets by Asset Class/Sub-class"]
{"$rows_left_out":177}
{"sheet":"SE7","index":19,"n_rows":31,"n_cols":16,"rows_kept":31,"cut":false,"hidden":false,"merged":[[1,12,1,15]]}
[{"$f":"MEAB11&\" - \"&Date","v":" - Supporting Table SE7   List of capital projects affected by Adjustments Budget - July 2021"}]
["R thousands",null,null,null,null,null,null,null,null,null,null,null,{"$f":"Head3","v":"Budget Year 2024/25"}]
["Function","Project Description","Project Number","Type","MTSF Service Outcome","IUDF","Own Strategic Objectives","Asset Class","Asset Sub-Class","Ward Location","GPS Longitude","GPS Lattitude",{"$f":"Head9","v":"Budget Year +1 2025/26"},{"$f":"Head7","v":"Adjusted Budget"},{"$f":"Head10","v":"Budget Year +2 2026/27"},{"$f":"Head11","v":"Annual target 2024/25"}]
["Parent municipality:"]
["List all capital projects grouped by Function"]
[]
{"$rows_left_out":25}